Konuyu Oyla:
  • Derecelendirme: 0/5 - 0 oy
  • 1
  • 2
  • 3
  • 4
  • 5
android paketleme hatası
#11
BlHGSeu.png
bu sefer de dosya yolunu kabul etmiyor nvpack yerine yüklüyordu her şeyi kaldırdım sadece android studio kurdum bu hatayı aldım
Ara
Cevapla
#12
NVPack ve studio yu kaldırıp tüm dosyaları temizle demiştim önceki mesajlarda dikkat edersen, C de ne var ne yoksa android ile alakalı sil gitsin. ondan sonra kur. ben NVPack uzun zamandır kullanmıyorum, dolayısıyla şu şekilde temizlemen lazım diyemem, formatlardan sonra sadece studio kurdum. vaktin varsa çak format temiz kurulum yap gitsin. sadece documentation linkinde gösterilen adımları uygula yeter.
Ara
Cevapla
#13
UATHelper: Packaging (Android (Multi:ASTC,DXT,ETC2)): Welcome to Gradle 6.1.1!
UATHelper: Packaging (Android (Multi:ASTC,DXT,ETC2)): Here are the highlights of this release:
UATHelper: Packaging (Android (Multi:ASTC,DXT,ETC2)):  - Reusable dependency cache
UATHelper: Packaging (Android (Multi:ASTC,DXT,ETC2)):  - Configurable compilation order between Groovy/Kotlin/Java/Scala
UATHelper: Packaging (Android (Multi:ASTC,DXT,ETC2)):  - New sample projects in Gradle's documentation
UATHelper: Packaging (Android (Multi:ASTC,DXT,ETC2)): For more details see https://docs.gradle.org/6.1.1/release-notes.html
UATHelper: Packaging (Android (Multi:ASTC,DXT,ETC2)): To honour the JVM settings for this build a new JVM will be forked. Please consider using the daemon: https://docs.gradle.org/6.1.1/userguide/...aemon.html.
UATHelper: Packaging (Android (Multi:ASTC,DXT,ETC2)): Daemon will be stopped at the end of the build stopping after processing
UATHelper: Packaging (Android (Multi:ASTC,DXT,ETC2)): Build-tool 31.0.0 is missing DX at C:\Users\BARAT\Desktop\sdkdosyas�\build-tools\31.0.0\dx.bat
UATHelper: Packaging (Android (Multi:ASTC,DXT,ETC2)): File C:\Users\BARAT\.android\repositories.cfg could not be loaded.
UATHelper: Packaging (Android (Multi:ASTC,DXT,ETC2)): Build-tool 31.0.0 is missing DX at C:\Users\BARAT\Desktop\sdkdosyas�\build-tools\31.0.0\dx.bat
UATHelper: Packaging (Android (Multi:ASTC,DXT,ETC2)): FAILURE: Build failed with an exception.
UATHelper: Packaging (Android (Multi:ASTC,DXT,ETC2)): * What went wrong:
UATHelper: Packaging (Android (Multi:ASTC,DXT,ETC2)): Could not determine the dependencies of task ':app:compileReleaseJavaWithJavac'.
UATHelper: Packaging (Android (Multi:ASTC,DXT,ETC2)): > Installed Build Tools revision 31.0.0 is corrupted. Remove and install again using the SDK Manager.
UATHelper: Packaging (Android (Multi:ASTC,DXT,ETC2)): * Try:
UATHelper: Packaging (Android (Multi:ASTC,DXT,ETC2)): Run with --stacktrace option to get the stack trace. Run with --info or --debug option to get more log output. Run with --scan to get full insights.
UATHelper: Packaging (Android (Multi:ASTC,DXT,ETC2)): * Get more help at https://help.gradle.org
UATHelper: Packaging (Android (Multi:ASTC,DXT,ETC2)): BU�LD FAILED in 2m 47s
UATHelper: Packaging (Android (Multi:ASTC,DXT,ETC2)): ERROR: cmd.exe failed with args /c "C:\Users\BARAT\Documents\Unreal Projects\MyProject\Intermediate\Android\arm64\gradle\rungradle.bat" :app:assembleRelease
UATHelper: Packaging (Android (Multi:ASTC,DXT,ETC2)):        (see C:\Users\BARAT\AppData\Roaming\Unreal Engine\AutomationTool\Logs\C+Program+Files+Epic+Games+UE_4.26\Log.txt for full exception trace)
UATHelper: Packaging (Android (Multi:ASTC,DXT,ETC2)): AutomationTool exiting with ExitCode=1 (Error_Unknown)
UATHelper: Packaging (Android (Multi:ASTC,DXT,ETC2)): BUILD FAILED
PackagingResults: Error: Unknown Error

bak yine verdi bu hatayı
Ara
Cevapla
#14
Screenshot_1.png

Screenshot_2.png

Screenshot_3.png

Ayarların bu şekilde mi ?
Ara
Cevapla
#15
çözdüm sorunu yakında nasıl yaptığımızı gösteren bir yazı paylaşacam
Ara
Cevapla
 


Konu ile Alakalı Benzer Konular
Konular Yazar Yorumlar Okunma Son Yorum
  Paketleme hakkında mariposaaaa 1 142 27-08-2021, Saat: 11:09
Son Yorum: nonlinear
  play store için paketleme hatası Berat Deniz 8 838 25-08-2021, Saat: 21:14
Son Yorum: TRYilan
  [ACEMİ SORUSU] 4.26 Android Studio Yükleme bsrsk_ 2 251 11-08-2021, Saat: 12:54
Son Yorum: bsrsk_
Photo 4.25 Ve üzeri sürümler için android setup yasinsimsk 2 591 03-04-2021, Saat: 22:29
Son Yorum: yasinsimsk
  Paketleme Hatası fatih789 12 1,044 12-02-2021, Saat: 16:19
Son Yorum: fatih789
  paketleme yayınlama fatih789 1 322 11-09-2020, Saat: 21:46
Son Yorum: nonlinear
  [ACEMİ SORUSU] playstore yükleme hatası fatih789 1 358 26-08-2020, Saat: 22:22
Son Yorum: fatih789
  [ACEMİ SORUSU] paketleme hatası fatih789 2 422 25-08-2020, Saat: 18:02
Son Yorum: fatih789
  [ACEMİ SORUSU] paketleme yayınlama fatih789 2 451 23-08-2020, Saat: 00:11
Son Yorum: fatih789
  [ACEMİ SORUSU] obb dosya yolu hatası fatih789 11 1,322 21-08-2020, Saat: 22:46
Son Yorum: fatih789

Hızlı Menü:


Konuyu Okuyanlar: 1 Ziyaretçi

Unreal Engine Türkiye

This forum is community driven and supported by voluntary community members. It has nothing to do with Epic Games.

Bu site sadece destek amaçlıdır. Epic Games ile bir ilgisi yoktur.