Konuyu Oyla:
  • Derecelendirme: 0/5 - 0 oy
  • 1
  • 2
  • 3
  • 4
  • 5
UE4 İndirdiğim Github projesini exe yapamıyorum
#1

Aşağıdada belirtilmiş ben Tom Looman adlı şahsın yapmış olduğu survival örneğini incelemek istedim fakat packagingden win64den(32 bitide yapamıyor) exe haline dönüştüremiyorum.Cook yapıyorum olmuyor sorunumu çözerseniz çok teşekkür ederim.Unity'de bu kadar sorunla karşılaşmadım Smile

Package hatası :
MainFrameActions: Packaging (Windows (64-bit)): Program.Main: ERROR: AutomationTool terminated with exception:
MainFrameActions: Packaging (Windows (64-bit)): Program.Main: ERROR: Exception in AutomationUtils.Automation: You are attempting to compile on a machine that does not have a supported compiler!
MainFrameActions: Packaging (Windows (64-bit)): Stacktrace:    konum: AutomationTool.UE4Build.Build(BuildAgenda Agenda, Nullable`1 InDeleteBuildProducts, Boolean InUpdateVersionFiles, Boolean InForceNoXGE, Boolean InUseParallelExecutor, Boolean InForceNonUnity, Boolean InForceUnity, Boolean InShowProgress, Dictionary`2 PlatformEnvVars)
MainFrameActions: Packaging (Windows (64-bit)):    konum: Project.Build(BuildCommand Command, ProjectParams Params, Int32 WorkingCL)
MainFrameActions: Packaging (Windows (64-bit)):    konum: BuildCookRun.DoBuildCookRun(ProjectParams Params)
MainFrameActions: Packaging (Windows (64-bit)):    konum: BuildCommand.Execute()
MainFrameActions: Packaging (Windows (64-bit)):    konum: AutomationTool.Automation.Execute(List`1 CommandsToExecute, CaselessDictionary`1 Commands)
MainFrameActions: Packaging (Windows (64-bit)):    konum: AutomationTool.Automation.Process(String[] CommandLine)
MainFrameActions: Packaging (Windows (64-bit)):    konum: AutomationTool.Program.MainProc(Object Param)
MainFrameActions: Packaging (Windows (64-bit)):    konum: AutomationTool.InternalUtils.RunSingleInstance(Action`1 Main, Object Param)
MainFrameActions: Packaging (Windows (64-bit)):    konum: AutomationTool.Program.Main()
MainFrameActions: Packaging (Windows (64-bit)): ProcessManager.KillAll: Trying to kill 0 spawned processes.
MainFrameActions: Packaging (Windows (64-bit)): Program.Main: AutomationTool exiting with ExitCode=Error_Unknown
MainFrameActions: Packaging (Windows (64-bit)): Domain_ProcessExit
MainFrameActions: Packaging (Windows (64-bit)): copying UAT log files...
MainFrameActions: Packaging (Windows (64-bit)): RunUAT.bat ERROR: AutomationTool was unable to run successfully.
MainFrameActions: Packaging (Windows (64-bit)): BUILD FAILED
PackagingResults:Error: Error Unknown Error
Ara
Cevapla
#2
(08-02-2016, Saat: 18:45)utku_gurler Adlı Kullanıcıdan Alıntı:  Aşağıdada belirtilmiş ben Tom Looman adlı şahsın yapmış olduğu survival örneğini incelemek istedim fakat packagingden win64den(32 bitide yapamıyor) exe haline dönüştüremiyorum.Cook yapıyorum olmuyor sorunumu çözerseniz çok teşekkür ederim.Unity'de bu kadar sorunla karşılaşmadım Smile

Package hatası :
MainFrameActions: Packaging (Windows (64-bit)): Program.Main: ERROR: AutomationTool terminated with exception:
MainFrameActions: Packaging (Windows (64-bit)): Program.Main: ERROR: Exception in AutomationUtils.Automation: You are attempting to compile on a machine that does not have a supported compiler!
MainFrameActions: Packaging (Windows (64-bit)): Stacktrace:    konum: AutomationTool.UE4Build.Build(BuildAgenda Agenda, Nullable`1 InDeleteBuildProducts, Boolean InUpdateVersionFiles, Boolean InForceNoXGE, Boolean InUseParallelExecutor, Boolean InForceNonUnity, Boolean InForceUnity, Boolean InShowProgress, Dictionary`2 PlatformEnvVars)
MainFrameActions: Packaging (Windows (64-bit)):    konum: Project.Build(BuildCommand Command, ProjectParams Params, Int32 WorkingCL)
MainFrameActions: Packaging (Windows (64-bit)):    konum: BuildCookRun.DoBuildCookRun(ProjectParams Params)
MainFrameActions: Packaging (Windows (64-bit)):    konum: BuildCommand.Execute()
MainFrameActions: Packaging (Windows (64-bit)):    konum: AutomationTool.Automation.Execute(List`1 CommandsToExecute, CaselessDictionary`1 Commands)
MainFrameActions: Packaging (Windows (64-bit)):    konum: AutomationTool.Automation.Process(String[] CommandLine)
MainFrameActions: Packaging (Windows (64-bit)):    konum: AutomationTool.Program.MainProc(Object Param)
MainFrameActions: Packaging (Windows (64-bit)):    konum: AutomationTool.InternalUtils.RunSingleInstance(Action`1 Main, Object Param)
MainFrameActions: Packaging (Windows (64-bit)):    konum: AutomationTool.Program.Main()
MainFrameActions: Packaging (Windows (64-bit)): ProcessManager.KillAll: Trying to kill 0 spawned processes.
MainFrameActions: Packaging (Windows (64-bit)): Program.Main: AutomationTool exiting with ExitCode=Error_Unknown
MainFrameActions: Packaging (Windows (64-bit)): Domain_ProcessExit
MainFrameActions: Packaging (Windows (64-bit)): copying UAT log files...
MainFrameActions: Packaging (Windows (64-bit)): RunUAT.bat ERROR: AutomationTool was unable to run successfully.
MainFrameActions: Packaging (Windows (64-bit)): BUILD FAILED
PackagingResults:Error: Error Unknown Error
kardeşim eyer kendine map hazırladıysan onu packege project etmek istiyorsan  oo adam yaptığı  test levelleri sil sildikten sonra  kendi projeni save as.. yap kaydet ve sonra packega project yap
Ara
Cevapla
#3
(08-02-2016, Saat: 21:15)violefast12 Adlı Kullanıcıdan Alıntı:  
(08-02-2016, Saat: 18:45)utku_gurler Adlı Kullanıcıdan Alıntı:  Aşağıdada belirtilmiş ben Tom Looman adlı şahsın yapmış olduğu survival örneğini incelemek istedim fakat packagingden win64den(32 bitide yapamıyor) exe haline dönüştüremiyorum.Cook yapıyorum olmuyor sorunumu çözerseniz çok teşekkür ederim.Unity'de bu kadar sorunla karşılaşmadım Smile

Package hatası :
MainFrameActions: Packaging (Windows (64-bit)): Program.Main: ERROR: AutomationTool terminated with exception:
MainFrameActions: Packaging (Windows (64-bit)): Program.Main: ERROR: Exception in AutomationUtils.Automation: You are attempting to compile on a machine that does not have a supported compiler!
MainFrameActions: Packaging (Windows (64-bit)): Stacktrace:    konum: AutomationTool.UE4Build.Build(BuildAgenda Agenda, Nullable`1 InDeleteBuildProducts, Boolean InUpdateVersionFiles, Boolean InForceNoXGE, Boolean InUseParallelExecutor, Boolean InForceNonUnity, Boolean InForceUnity, Boolean InShowProgress, Dictionary`2 PlatformEnvVars)
MainFrameActions: Packaging (Windows (64-bit)):    konum: Project.Build(BuildCommand Command, ProjectParams Params, Int32 WorkingCL)
MainFrameActions: Packaging (Windows (64-bit)):    konum: BuildCookRun.DoBuildCookRun(ProjectParams Params)
MainFrameActions: Packaging (Windows (64-bit)):    konum: BuildCommand.Execute()
MainFrameActions: Packaging (Windows (64-bit)):    konum: AutomationTool.Automation.Execute(List`1 CommandsToExecute, CaselessDictionary`1 Commands)
MainFrameActions: Packaging (Windows (64-bit)):    konum: AutomationTool.Automation.Process(String[] CommandLine)
MainFrameActions: Packaging (Windows (64-bit)):    konum: AutomationTool.Program.MainProc(Object Param)
MainFrameActions: Packaging (Windows (64-bit)):    konum: AutomationTool.InternalUtils.RunSingleInstance(Action`1 Main, Object Param)
MainFrameActions: Packaging (Windows (64-bit)):    konum: AutomationTool.Program.Main()
MainFrameActions: Packaging (Windows (64-bit)): ProcessManager.KillAll: Trying to kill 0 spawned processes.
MainFrameActions: Packaging (Windows (64-bit)): Program.Main: AutomationTool exiting with ExitCode=Error_Unknown
MainFrameActions: Packaging (Windows (64-bit)): Domain_ProcessExit
MainFrameActions: Packaging (Windows (64-bit)): copying UAT log files...
MainFrameActions: Packaging (Windows (64-bit)): RunUAT.bat ERROR: AutomationTool was unable to run successfully.
MainFrameActions: Packaging (Windows (64-bit)): BUILD FAILED
PackagingResults:Error: Error Unknown Error
kardeşim eyer kendine map hazırladıysan onu packege project etmek istiyorsan  oo adam yaptığı  test levelleri sil sildikten sonra  kendi projeni save as.. yap kaydet ve sonra packega project yap

Yaptım olmadı hala aynı hatayı veriyor.
Ara
Cevapla
#4
Projeyi, Türkçe karakter içermeyen bir dizine atıp tekrar deneyin.
Cevapla
 


Konu ile Alakalı Benzer Konular
Konular Yazar Yorumlar Okunma Son Yorum
  Blueprint projesini C++ yapmak. GGgamer 19 980 02-12-2018, Saat: 17:14
Son Yorum: Ozzy

Hızlı Menü:


Unreal Engine Türkiye

This forum is only for fans and support. It has nothing to do with Epic Games.

Bu site sadece fan ve destek amaçlıdır. Epic Games ile bir ilgisi yoktur.